{"text_format":"1","workbook":"xlsx","n_sheets":3,"sheets":["Sheet1","Data","Sheet2"],"not_rendered":{"charts":0,"images":0,"macros":0,"external_links":0,"defined_names":2,"comments":2,"pivot_tables":0},"unopened":[],"bounds":{"document_bytes":16777216,"sheet_cells":100000,"rows_first":2000,"rows_last":500,"rows_between":2000,"halvings":0,"cell_chars":16384,"cell_head_chars":4096},"cells_cut":0,"cells_raw":0,"read":"whole","date_system":"1900"}

{"sheet":"Sheet1","index":0,"n_rows":48,"n_cols":27,"rows_kept":48,"cut":false,"hidden":false,"merged":[[0,0,0,27],[3,6,3,10],[4,6,4,10],[5,6,5,10],[6,6,6,10],[9,7,9,9],[10,7,10,9],[13,10,13,11],[14,10,14,11],[13,7,13,9],[14,7,14,9],[9,22,9,23],[14,22,14,23],[9,12,9,13],[10,10,10,11],[5,20,5,21],[5,22,5,24],[13,26,13,27],[14,26,14,27],[14,12,14,13],[10,15,10,17],[11,15,11,17],[10,18,10,19],[11,18,11,19],[15,22,15,23],[52,18,52,19],[49,20,49,21],[49,26,49,27],[31,22,31,23],[33,22,33,23],[34,22,34,23],[32,20,32,21],[33,20,33,21],[34,20,34,21],[15,26,15,27],[44,26,44,27],[46,18,46,19],[39,18,39,19],[16,18,16,19],[42,26,42,27],[41,26,41,27],[40,26,40,27],[43,26,43,27],[21,22,21,23],[20,20,20,21],[24,22,24,23],[25,22,25,23],[27,22,27,23],[30,22,30,23],[19,18,19,19],[18,18,18,19],[36,18,36,19],[37,18,37,19],[31,15,31,17],[23,15,23,17],[24,15,24,17],[30,18,30,19],[24,18,24,19],[25,18,25,19],[26,18,26,19],[25,15,25,17],[29,15,29,17],[30,15,30,17],[31,18,31,19],[32,18,32,19],[22,22,22,23],[24,20,24,21],[28,15,28,17],[26,15,26,17],[27,15,27,17],[29,22,29,23],[29,20,29,21],[12,18,12,19],[13,18,13,19],[14,18,14,19],[15,18,15,19],[17,18,17,19],[41,15,41,17],[42,15,42,17],[43,15,43,17],[37,15,37,17],[38,15,38,17],[39,15,39,17],[40,15,40,17],[33,15,33,17],[34,15,34,17],[35,15,35,17],[36,15,36,17],[34,18,34,19],[27,18,27,19],[28,18,28,19],[29,18,29,19],[12,15,12,17],[13,15,13,17],[14,15,14,17],[15,15,15,17],[35,12,35,13],[43,18,43,19],[44,18,44,19],[42,12,42,13],[34,10,34,11],[35,10,35,11],[22,7,22,9],[23,7,23,9],[26,7,26,9],[27,7,27,9],[43,7,43,9],[44,7,44,9],[30,10,30,11],[29,7,29,9],[32,7,32,9],[34,7,34,9],[40,7,40,9],[41,7,41,9],[35,7,35,9],[24,7,24,9],[25,7,25,9],[31,7,31,9],[29,10,29,11],[9,20,9,21],[10,20,10,21],[11,20,11,21],[12,20,12,21],[18,20,18,21],[19,20,19,21],[13,20,13,21],[14,20,14,21],[15,20,15,21],[16,20,16,21],[17,20,17,21],[9,2,9,4],[10,2,10,4],[43,12,43,13],[10,12,10,13],[31,2,31,4],[26,10,26,11],[27,10,27,11],[28,10,28,11],[24,10,24,11],[23,12,23,13],[27,2,27,4],[24,2,24,4],[25,2,25,4],[26,2,26,4],[25,10,25,11],[17,10,17,11],[18,10,18,11],[20,12,20,13],[36,10,36,11],[43,10,43,11],[32,10,32,11],[31,12,31,13],[38,12,38,13],[37,7,37,9],[25,20,25,21],[26,20,26,21],[27,20,27,21],[16,7,16,9],[15,7,15,9],[25,12,25,13],[19,10,19,11],[17,15,17,17],[16,15,16,17],[21,15,21,17],[20,15,20,17],[19,15,19,17],[21,20,21,21],[22,20,22,21],[20,18,20,19],[21,18,21,19],[18,15,18,17],[22,15,22,17],[23,18,23,19],[22,18,22,19],[20,10,20,11],[23,20,23,21],[18,12,18,13],[19,12,19,13],[22,2,22,4],[21,7,21,9],[29,2,29,4],[30,2,30,4],[18,7,18,9],[19,7,19,9],[32,12,32,13],[33,12,33,13],[30,12,30,13],[18,2,18,4],[23,2,23,4],[21,10,21,11],[22,12,22,13],[28,2,28,4],[30,7,30,9],[50,2,50,3],[49,2,49,3],[47,12,47,13],[47,7,47,9],[19,2,19,4],[37,2,37,4],[20,7,20,9],[49,12,49,13],[44,2,44,4],[45,2,45,4],[46,2,46,4],[26,12,26,13],[27,12,27,13],[28,12,28,13],[29,12,29,13],[22,10,22,11],[23,10,23,11],[21,12,21,13],[21,2,21,4],[32,2,32,4],[28,7,28,9],[31,10,31,11],[33,10,33,11],[20,2,20,4],[12,2,12,4],[11,2,11,4],[11,10,11,11],[12,10,12,11],[11,12,11,13],[12,12,12,13],[12,7,12,9],[16,12,16,13],[17,7,17,9],[17,12,17,13],[13,2,13,4],[16,10,16,11],[13,12,13,13],[14,2,14,4],[17,2,17,4],[11,7,11,9],[10,5,11,5],[15,12,15,13],[15,2,15,4],[15,10,15,11],[16,2,16,4],[49,22,49,23],[47,20,47,21],[49,18,49,19],[47,18,47,19],[36,2,36,4],[32,15,32,17],[36,7,36,9],[35,20,35,21],[49,7,49,9],[49,10,49,11],[33,7,33,9],[32,22,32,23],[42,7,42,9],[39,10,39,11],[40,10,40,11],[41,10,41,11],[42,10,42,11],[45,12,45,13],[46,12,46,13],[44,12,44,13],[33,18,33,19],[44,15,44,17],[39,12,39,13],[34,12,34,13],[28,20,28,21],[24,12,24,13],[34,26,34,27],[47,22,47,23],[45,26,45,27],[35,26,35,27],[27,26,27,27],[28,26,28,27],[29,26,29,27],[30,26,30,27],[31,26,31,27],[36,26,36,27],[40,18,40,19],[41,18,41,19],[42,18,42,19],[38,18,38,19],[40,22,40,23],[31,20,31,21],[38,20,38,21],[46,20,46,21],[36,20,36,21],[37,20,37,21],[32,26,32,27],[36,12,36,13],[9,1,11,1],[16,26,16,27],[19,22,19,23],[20,26,20,27],[12,22,12,23],[24,26,24,27],[25,26,25,27],[26,26,26,27],[21,26,21,27],[12,26,12,27],[10,26,10,27],[26,22,26,23],[23,22,23,23],[16,22,16,23],[11,22,11,23],[11,26,11,27],[22,26,22,27],[17,26,17,27],[18,26,18,27],[23,26,23,27],[19,26,19,27],[17,22,17,23],[18,22,18,23],[20,22,20,23],[37,26,37,27],[47,26,47,27],[46,26,46,27],[43,22,43,23],[37,12,37,13],[38,22,38,23],[39,22,39,23],[38,2,38,4],[39,2,39,4],[38,10,38,11],[38,7,38,9],[39,7,39,9],[42,20,42,21],[43,20,43,21],[44,20,44,21],[45,20,45,21],[40,12,40,13],[41,12,41,13],[46,7,46,9],[45,7,45,9],[33,26,33,27],[41,22,41,23],[42,22,42,23],[37,22,37,23],[47,15,47,17],[43,2,43,4],[38,26,38,27],[39,26,39,27],[48,26,48,27],[48,22,48,23],[33,2,33,4],[34,2,34,4],[35,2,35,4],[35,18,35,19],[44,10,44,11],[45,10,45,11],[46,10,46,11],[39,20,39,21],[40,20,40,21],[41,20,41,21],[45,18,45,19],[46,15,46,17],[45,15,45,17],[37,10,37,11],[1,0,1,27],[56,22,56,23],[3,22,3,24],[4,22,4,24],[42,2,42,4],[40,2,40,4],[41,2,41,4],[3,2,3,4],[4,2,4,4],[5,2,5,4],[6,2,6,4],[4,20,4,21],[3,20,3,21],[47,10,47,11],[44,22,44,23],[45,22,45,23],[46,22,46,23],[13,22,13,23],[49,15,49,17],[10,22,10,23],[30,20,30,21],[35,22,35,23],[36,22,36,23],[28,22,28,23]]}
[" Commercial Lighting Proposal Calculation"]
["Conditioned Space Lighting "]
[]
[null,null,"Customer Name:",null,null,null,null,null,null,null,null,null,null,null,null,null,null,null,null,null,"Business Type:"]
[null,null,"Physical Address:",null,null,null,null,null,null,null,null,null,null,null,null,null,null,null,null,null,"Account Number:"]
[null,null,"City, State Zip:"]
[]
[]
[]
[null,"Conditioned Space",null,null,null,"Annual",null,null,null,null,null,null,"Existing Lighting ",null,null,null,null,null,null,null,"Retrofit Lighting",null,"Summer",null,"Winter","Annual "]
[null,null,null,null,null,"Operating Hours","Existing","Existing ",null,null,"Existing ",null,"Total kW",null,"New","Retrofit",null,null,"Retrofit",null,"Total kW",null,"Demand (kW)",null,"Demand (kW)","Energy (kWh)","Rebate Amount"]
[null,null,"Location",null,null,null,"Quantity","Fixture Description",null,null," kW per Fixture",null,"(Quantity x Fixture kW) ",null,"Quantity","Fixture Description",null,null," kW per Fixture",null,"(Quantity X Fixture kW)",null,"Reduction ",null,"Reduction","Reduction","at $0.250 per Watt"]
[null,null,null,null,null,null,null,null,null,null,null,null,{"$f":"IF(K13=\"\",\"\",SUM(G13*K13))","v":""},null,null,null,null,null,null,null,{"$f":"IF(S13=\"\",\"\",SUM(O13*S13))","v":""},null,{"$f":"IF(B13=\"yes\", (Y13*(3412/12000))+Y13, IF(B13=\"no\",1*Y13,\"\"))","v":""},null,{"$f":"IF(F13>0, ROUND(M13-U13,3), \"\")","v":""},{"$f":"IF(B13>0, (F13*W13*7/12)+(F13*Y13*5/12), \"\")","v":""},{"$f":"IF(B13=\"yes\",ROUND(Y13*250,2),IF(B13=\"no\",\"\",\"\"))","v":""}]
[null,null,null,null,null,null,null,null,null,null,null,null,{"$f":"IF(K14=\"\",\"\",SUM(G14*K14))","v":""},null,null,null,null,null,null,null,{"$f":"IF(S14=\"\",\"\",SUM(O14*S14))","v":""},null,{"$f":"IF(B14=\"yes\", (Y14*(3412/12000))+Y14, IF(B14=\"no\",1*Y14,\"\"))","v":""},null,{"$f":"IF(F14>0, ROUND(M14-U14,3), \"\")","v":""},{"$f":"IF(B14>0, (F14*W14*7/12)+(F14*Y14*5/12), \"\")","v":""},{"$f":"IF(B14=\"yes\",ROUND(Y14*250,2),IF(B14=\"no\",\"\",\"\"))","v":""}]
[null,null,null,null,null,null,null,null,null,null,null,null,{"$f":"IF(K15=\"\",\"\",SUM(G15*K15))","v":""},null,null,null,null,null,null,null,{"$f":"IF(S15=\"\",\"\",SUM(O15*S15))","v":""},null,{"$f":"IF(B15=\"yes\", (Y15*(3412/12000))+Y15, IF(B15=\"no\",1*Y15,\"\"))","v":""},null,"",{"$f":"IF(B15>0, (F15*W15*7/12)+(F15*Y15*5/12), \"\")","v":""},""]
[null,null,null,null,null,null,null,null,null,null,null,null,"",null,null,null,null,null,null,null,{"$f":"IF(S16=\"\",\"\",SUM(O16*S16))","v":""},null,"",null,"","",""]
[null,null,null,null,null,null,null,null,null,null,null,null,"",null,null,null,null,null,null,null,"",null,"",null,"","",""]
[null,null,null,null,null,null,null,null,null,null,null,null,"",null,null,null,null,null,null,null,"",null,"",null,"","",""]
[null,null,null,null,null,null,null,null,null,null,null,null,"",null,null,null,null,null,null,null,"",null,"",null,"","",""]
[null,null,null,null,null,null,null,null,null,null,null,null,"",null,null,null,null,null,null,null,"",null,"",null,"","",""]
[null,null,null,null,null,null,null,null,null,null,null,null,"",null,null,null,null,null,null,null,"",null,"",null,"","",""]
[null,null,null,null,null,null,null,null,null,null,null,null,"",null,null,null,null,null,null,null,"",null,"",null,"","",""]
[null,null,null,null,null,null,null,null,null,null,null,null,"",null,null,null,null,null,null,null,"",null,"",null,"","",""]
[null,null,null,null,null,null,null,null,null,null,null,null,"",null,null,null,null,null,null,null,"",null,"",null,"","",""]
[null,null,null,null,null,null,null,null,null,null,null,null,"",null,null,null,null,null,null,null,"",null,"",null,"","",""]
[null,null,null,null,null,null,null,null,null,null,null,null,"",null,null,null,null,null,null,null,"",null,"",null,"","",""]
[null,null,null,null,null,null,null,null,null,null,null,null,"",null,null,null,null,null,null,null,"",null,"",null,"","",""]
[null,null,null,null,null,null,null,null,null,null,null,null,"",null,null,null,null,null,null,null,"",null,"",null,"","",""]
[null,null,null,null,null,null,null,null,null,null,null,null,"",null,null,null,null,null,null,null,"",null,"",null,"","",""]
[null,null,null,null,null,null,null,null,null,null,{"$f":"IF(H30=\"\",\"\",VLOOKUP(H30,Data!$A$1:$B$98,2,FALSE))","v":""},null,"",null,null,null,null,null,null,null,"",null,"",null,"","",""]
[null,null,null,null,null,null,null,null,null,null,{"$f":"IF(H31=\"\",\"\",VLOOKUP(H31,Data!$A$1:$B$98,2,FALSE))","v":""},null,"",null,null,null,null,null,{"$f":"IF(P31=\"\",\"\",VLOOKUP(P31,Data!$D$1:$E$48,2,FALSE))","v":""},null,"",null,"",null,"","",""]
[null,null,null,null,null,null,null,null,null,null,{"$f":"IF(H32=\"\",\"\",VLOOKUP(H32,Data!$A$1:$B$98,2,FALSE))","v":""},null,"",null,null,null,null,null,{"$f":"IF(P32=\"\",\"\",VLOOKUP(P32,Data!$D$1:$E$48,2,FALSE))","v":""},null,"",null,"",null,"","",""]
[null,null,null,null,null,null,null,null,null,null,{"$f":"IF(H33=\"\",\"\",VLOOKUP(H33,Data!$A$1:$B$98,2,FALSE))","v":""},null,"",null,null,null,null,null,{"$f":"IF(P33=\"\",\"\",VLOOKUP(P33,Data!$D$1:$E$48,2,FALSE))","v":""},null,"",null,"",null,"","",""]
[null,null,null,null,null,null,null,null,null,null,{"$f":"IF(H34=\"\",\"\",VLOOKUP(H34,Data!$A$1:$B$98,2,FALSE))","v":""},null,"",null,null,null,null,null,{"$f":"IF(P34=\"\",\"\",VLOOKUP(P34,Data!$D$1:$E$48,2,FALSE))","v":""},null,"",null,"",null,"","",""]
[null,null,null,null,null,null,null,null,null,null,{"$f":"IF(H35=\"\",\"\",VLOOKUP(H35,Data!$A$1:$B$98,2,FALSE))","v":""},null,"",null,null,null,null,null,{"$f":"IF(P35=\"\",\"\",VLOOKUP(P35,Data!$D$1:$E$48,2,FALSE))","v":""},null,"",null,"",null,"","",""]
[null,null,null,null,null,null,null,null,null,null,{"$f":"IF(H36=\"\",\"\",VLOOKUP(H36,Data!$A$1:$B$98,2,FALSE))","v":""},null,"",null,null,null,null,null,{"$f":"IF(P36=\"\",\"\",VLOOKUP(P36,Data!$D$1:$E$48,2,FALSE))","v":""},null,"",null,"",null,"","",""]
[null,null,null,null,null,null,null,null,null,null,{"$f":"IF(H37=\"\",\"\",VLOOKUP(H37,Data!$A$1:$B$98,2,FALSE))","v":""},null,"",null,null,null,null,null,{"$f":"IF(P37=\"\",\"\",VLOOKUP(P37,Data!$D$1:$E$48,2,FALSE))","v":""},null,"",null,"",null,"","",""]
[null,null,null,null,null,null,null,null,null,null,{"$f":"IF(H38=\"\",\"\",VLOOKUP(H38,Data!$A$1:$B$98,2,FALSE))","v":""},null,"",null,null,null,null,null,{"$f":"IF(P38=\"\",\"\",VLOOKUP(P38,Data!$D$1:$E$48,2,FALSE))","v":""},null,"",null,"",null,"","",""]
[null,null,null,null,null,null,null,null,null,null,{"$f":"IF(H39=\"\",\"\",VLOOKUP(H39,Data!$A$1:$B$98,2,FALSE))","v":""},null,"",null,null,null,null,null,{"$f":"IF(P39=\"\",\"\",VLOOKUP(P39,Data!$D$1:$E$48,2,FALSE))","v":""},null,"",null,"",null,"","",""]
[null,null,null,null,null,null,null,null,null,null,{"$f":"IF(H40=\"\",\"\",VLOOKUP(H40,Data!$A$1:$B$98,2,FALSE))","v":""},null,"",null,null,null,null,null,{"$f":"IF(P40=\"\",\"\",VLOOKUP(P40,Data!$D$1:$E$48,2,FALSE))","v":""},null,"",null,"",null,"","",""]
[null,null,null,null,null,null,null,null,null,null,{"$f":"IF(H41=\"\",\"\",VLOOKUP(H41,Data!$A$1:$B$98,2,FALSE))","v":""},null,"",null,null,null,null,null,{"$f":"IF(P41=\"\",\"\",VLOOKUP(P41,Data!$D$1:$E$48,2,FALSE))","v":""},null,"",null,"",null,"","",""]
[null,null,null,null,null,null,null,null,null,null,{"$f":"IF(H42=\"\",\"\",VLOOKUP(H42,Data!$A$1:$B$98,2,FALSE))","v":""},null,"",null,null,null,null,null,{"$f":"IF(P42=\"\",\"\",VLOOKUP(P42,Data!$D$1:$E$48,2,FALSE))","v":""},null,"",null,"",null,"","",""]
[null,null,null,null,null,null,null,null,null,null,{"$f":"IF(H43=\"\",\"\",VLOOKUP(H43,Data!$A$1:$B$98,2,FALSE))","v":""},null,"",null,null,null,null,null,{"$f":"IF(P43=\"\",\"\",VLOOKUP(P43,Data!$D$1:$E$48,2,FALSE))","v":""},null,"",null,"",null,"","",""]
[null,null,null,null,null,null,null,null,null,null,{"$f":"IF(H44=\"\",\"\",VLOOKUP(H44,Data!$A$1:$B$98,2,FALSE))","v":""},null,"",null,null,null,null,null,{"$f":"IF(P44=\"\",\"\",VLOOKUP(P44,Data!$D$1:$E$48,2,FALSE))","v":""},null,"",null,"",null,"","",""]
[null,null,null,null,null,null,null,null,null,null,{"$f":"IF(H45=\"\",\"\",VLOOKUP(H45,Data!$A$1:$B$98,2,FALSE))","v":""},null,"",null,null,null,null,null,{"$f":"IF(P45=\"\",\"\",VLOOKUP(P45,Data!$D$1:$E$48,2,FALSE))","v":""},null,"",null,"",null,"","",""]
[null,null,null,null,null,null,null,null,null,null,{"$f":"IF(H46=\"\",\"\",VLOOKUP(H46,Data!$A$1:$B$98,2,FALSE))","v":""},null,"",null,null,null,null,null,{"$f":"IF(P46=\"\",\"\",VLOOKUP(P46,Data!$D$1:$E$48,2,FALSE))","v":""},null,"",null,"",null,"","",""]
[null,null,null,null,null,null,null,null,null,null,{"$f":"IF(H47=\"\",\"\",VLOOKUP(H47,Data!$A$1:$B$98,2,FALSE))","v":""},null,"",null,null,null,null,null,{"$f":"IF(P47=\"\",\"\",VLOOKUP(P47,Data!$D$1:$E$48,2,FALSE))","v":""},null,"",null,"",null,"","",""]
[null,null,null,null,"Total",null,{"$f":"SUM(G13:G47)","v":0},null,null,null,null,null,{"$f":"SUM(M13:N47)","v":0},null,{"$f":"SUM(O13:O47)","v":0},null,null,null,{"$f":"IF(P48=\"\",\"\",VLOOKUP(P48,Data!$D$1:$E$35,2,FALSE))","v":""},null,{"$f":"SUM(U13:V47)","v":0},null,{"$f":"SUM(W13:X47)","v":0},null,{"$f":"SUM(Y13:Y47)","v":0},{"$f":"SUM(Z13:Z47)","v":0},{"$f":"SUM(AA13:AB47)","v":0}]

{"sheet":"Data","index":1,"n_rows":101,"n_cols":5,"rows_kept":101,"cut":false,"hidden":true,"merged":[[15,27,15,28],[16,23,16,26],[16,27,16,28],[6,19,6,20],[12,27,12,28],[13,27,13,28],[14,27,14,28]]}
["2ft X 2 U-Lamps (SM/ST)",9.5000000000000001E-2,null,"2ft X 2 U-Lamps (EL/T8)",6.2E-2]
["2ft X 2 U-Lamps (SM/ES)",7.9000000000000001E-2,null,"2ft X 2 U-Lamps (LPEL/T8)",5.0999999999999997E-2]
["2ft X 2 U-Lamps (ESM/ST)",8.7999999999999995E-2,null,"2ft X 1 Lamp (EL/T8)",2.1999999999999999E-2]
["2ft X 2 U-Lamps (ESM/ES)",7.1999999999999995E-2,null,"2ft X 1 Lamp (LPEL/T8)",1.4E-2]
["2ft X 2 U-Lamps (EL/T8)",6.2E-2,null,"2ft X 2 Lamps (EL/T8)",3.4000000000000002E-2]
["2ft X 2 U-Lamps (LPEL/T8)",5.0999999999999997E-2,null,"2ft X 2 Lamps (LPEL/T8)",2.8000000000000001E-2]
["2ft X 1 Lamp (SM/ST)",2.4E-2,null,"2ft X 3 Lamps (EL/T8)",5.0999999999999997E-2]
["2ft X 1 Lamp (ESM/ST)",2.1999999999999999E-2,null,"2ft X 3 Lamps (LPEL/T8)",4.2000000000000003E-2]
["2ft X 1 Lamp (EL/T8)",2.1999999999999999E-2,null,"3ft X 1 Lamp (EL/T8)",2.8000000000000001E-2]
["2ft X 1 Lamp (LPEL/T8)",1.4E-2,null,"3ft X 1 Lamp (LPEL/T8)",2.3E-2]
["2ft X 2 Lamps (SM/ST)",4.8000000000000001E-2,null,"3ft X 2 Lamps (EL/T8)",4.4999999999999998E-2]
["2ft X 2 Lamps (ESM/ST)",4.3999999999999997E-2,null,"3ft X 2 Lamps (LPEL/T8)",4.2000000000000003E-2]
["2ft X 2 Lamps (EL/T8)",3.4000000000000002E-2,null,"3ft X 3 Lamps (EL/T8)",6.2E-2]
["2ft X 2 Lamps (LPEL/T8)",2.8000000000000001E-2,null,"3ft X 3 Lamps (LPEL/T8)",6.0999999999999999E-2]
["2ft X 3 Lamps (SM/ST)",7.1999999999999995E-2,null,"4ft X 1 Lamp (EL/T8)",3.1E-2]
["2ft X 3 Lamps (ESM/ST)",6.6000000000000003E-2,null,"4ft X 1 Lamp (LPEL/T8)",2.5999999999999999E-2]
["2ft X 3 Lamps (EL/T8)",5.0999999999999997E-2,null,"4ft X 2 Lamp (EL/T8)32w",6.2E-2]
["2ft X 3 Lamps (LPEL/T8)",4.2000000000000003E-2,null,"4ft X 2 Lamp (EL/T8)28w",4.2000000000000003E-2]
["3ft X 1 Lamp (SM/ST)",3.5999999999999997E-2,null,"4ft X 2 Lamp (LPEL/T8)",5.0999999999999997E-2]
["3ft X 1 Lamp (ESM/ST)",3.3000000000000002E-2,null,"4ft X 2 Lamp (HO/T8)",7.3999999999999996E-2]
["3ft X 1 Lamp (EL/T8)",2.8000000000000001E-2,null,"4ft X 3 Lamp (EL/T8)",8.5999999999999993E-2]
["3ft X 1 Lamp (LPEL/T8)",2.3E-2,null,"4ft X 3 Lamp (LPEL/T8)",7.4999999999999997E-2]
["3ft X 2 Lamps (SM/ST)",7.0999999999999994E-2,null,"4ft X 4 Lamp (EL/T8)32w",0.105]
["3ft X 2 Lamps (ESM/ST)",6.6000000000000003E-2,null,"4ft X 4 Lamp (EL/T8)28w",8.4000000000000005E-2]
["3ft X 2 Lamps (EL/T8)",4.4999999999999998E-2,null,"4ft X 4 Lamp (LPEL/T8)",9.5000000000000001E-2]
["3ft X 2 Lamps (LPEL/T8)",4.2000000000000003E-2,null,"4ft X 6 Lamps (EL/T8/HO)",0.22700000000000001]
["3ft X 3 Lamps (SM/ST)",0.105,null,"5ft X 1 Lamp (EL/T8)",4.3999999999999997E-2]
["3ft X 3 Lamps (ESM/ST)",9.9000000000000005E-2,null,"8ft X 1 Lamp (EL/T8)",4.8000000000000001E-2]
["3ft X 3 Lamps (EL/T8)",6.2E-2,null,"8ft X 1 Lamp (LPEL/T8)",4.3999999999999997E-2]
["3ft X 3 Lamps (LPEL/T8)",6.0999999999999999E-2,null,"8ft X 2 Lamps (EL/T8)",0.109]
["4ft X 1 Lamp (SM/ST)",4.8000000000000001E-2,null,"8ft X 2 Lamps (LPEL/T8)",8.6999999999999994E-2]
["4ft X 1 Lamp (SM/ES)",0.04,null,"8ft X 3 Lamps (EL/T8)",0.157]
["4ft X 1 Lamp (ESM/ST)",4.3999999999999997E-2,null,"8ft X 4 Lamps (EL/T8)",0.218]
["4ft X 1 Lamp (ESM/ES)",3.5999999999999997E-2,null,"8ft X 1 Lamp HO (EL/T8)",0.1]
["4ft X 1 Lamp (EL/T8)",3.1E-2,null,"8ft X 2 Lamp HO (EL/T8)",0.20100000000000001]
["4ft X 1 Lamp (LPEL/T8)",2.5999999999999999E-2,null,"4ft X 2 Lamps T5 HO",0.114]
["4ft X 2 Lamp (SM/ST)",9.5000000000000001E-2,null,"4ft X 4 Lamps T5 HO",0.23499999999999999]
["4ft X 2 Lamp (SM/ES)",7.9000000000000001E-2,null,"4ft X 6 Lamps T5 HO",0.35599999999999998]
["4ft X 2 Lamp (ESM/ST)",8.7999999999999995E-2,null,"4ft X 8 Lamps T5 HO",0.47699999999999998]
["4ft X 2 Lamp (ESM/ES)",7.1999999999999995E-2,null,"150 Watt HPS Lamp",0.18]
["4ft X 2 Lamp (EL/T8)",6.2E-2,null,"175 Watt Pulse Start",0.22]
["4ft X 2 Lamp (LPEL/T8)",5.0999999999999997E-2,null,"250 Watt Pulse Start",0.28799999999999998]
["4ft X 3 Lamp (SM/ST)",0.14299999999999999,null,"750 Watt Pulse Start",0.81]
["4ft X 3 Lamp (SM/ES)",0.11899999999999999,null,"CFL 13 Watt",1.2999999999999999E-2]
["4ft X 3 Lamp (ESM/ST)",0.13200000000000001,null,"CFL 15 Watt",1.4999999999999999E-2]
["4ft X 3 Lamp (ESM/ES)",0.108,null,"CFL 18 Watt",1.7999999999999999E-2]
["4ft X 3 Lamp (EL/T8)",8.5999999999999993E-2,null,"CFL 23 Watt",2.3E-2]
["4ft X 3 Lamp (LPEL/T8)",7.4999999999999997E-2,null,"CFL 25 Watt",2.5000000000000001E-2]
["4ft X 4 Lamp (SM/ST)",0.19,null,"3w LED",3.0000000000000001E-3]
["4ft X 4 Lamp (SM/ES)",0.158,null,"5w LED",5.0000000000000001E-3]
["4ft X 4 Lamp (ESM/ST)",0.17599999999999999,null,"6w LED",6.0000000000000001E-3]
["4ft X 4 Lamp (ESM/ES)",0.14399999999999999]
["4ft X 4 Lamp (EL/T8)",0.105]
["4ft X 4 Lamp (LPEL/T8)",9.5000000000000001E-2]
["5ft X 1 Lamp (SM/ST)",7.0999999999999994E-2]
["5ft X 1 Lamp (EL/T8)",4.3999999999999997E-2]
["6ft X 1 Lamp (SM/ST)",0.1]
["6ft X 2 Lamps (SM/ST)",0.127]
["8ft X 1 Lamp (SM/ST)",8.8999999999999996E-2]
["8ft X 1 Lamp (SM/ES)",7.0999999999999994E-2]
["8ft X 1 Lamp (ESM/ST)",8.3000000000000004E-2]
["8ft X 1 Lamp (ESM/ES)",6.6000000000000003E-2]
["8ft X 1 Lamp (EL/T8)",4.8000000000000001E-2]
["8ft X 1 Lamp (LPEL/T8)",4.3999999999999997E-2]
["8ft X 2 Lamps (SM/ST)",0.17199999999999999]
["8ft X 2 Lamps (SM/ES)",0.14000000000000001]
["8ft X 2 Lamps (ESM/ST)",0.24099999999999999]
["8ft X 2 Lamps (ESM/ES)",0.123]
["8ft X 2 Lamps (EL/T8)",0.109]
["8ft X 2 Lamps (LPEL/T8)",8.6999999999999994E-2]
["8ft X 3 Lamps (SM/ST)",0.26100000000000001]
["8ft X 3 Lamps (SM/ES)",0.21099999999999999]
["8ft X 3 Lamps (ESM/ST)",0.32400000000000001]
["8ft X 3 Lamps (ESM/ES)",0.189]
["8ft X 3 Lamps (EL/T8)",0.157]
["8ft X 4 Lamps (SM/ST)",0.34399999999999997]
["8ft X 4 Lamps (SM/ES)",0.28000000000000003]
["8ft X 4 Lamps (ESM/ST)",0.48199999999999998]
["8ft X 4 Lamps (ESM/ES)",0.246]
["8ft X 4 Lamps (EL/T8)",0.218]
["8ft X 1 Lamp HO (SM/ST)",0.127]
["8ft X 1 Lamp HO (ESM/ST)",0.11899999999999999]
["8ft X 1 Lamp HO (EL/T8)",0.1]
["8ft X 2 Lamp HO (SM/ST)",0.253]
["8ft X 2 Lamp HO (ESM/ST)",0.23699999999999999]
["8ft X 2 Lamp HO (EL/T8)",0.20100000000000001]
["Incandescent 60 Watt Lamp",0.06]
["Incandescent 75 Watt Lamp",7.4999999999999997E-2]
["Incandescent 90 Watt Lamp",0.09]
["Incand. 100 Watt Lamp",0.1]
["Incand.150 Watt Lamp",0.15]
["Incand. 175 Watt Lamp",0.17499999999999999]
["175 Watt MH Lamp",0.20300000000000001]
["250 Watt MH Lamp",0.28999999999999998]
["400 Watt MH Lamp",0.46500000000000002]
["750 Watt MH Lamp",0.81]
["1000 Watt MH Lamp",1.1599999999999999]
[]
["30w Incandescent",0.03]
["40w Incandescent",0.04]
["10w CFL",0.01]

{"sheet":"Sheet2","index":2,"n_rows":0,"n_cols":0,"rows_kept":0,"cut":false,"hidden":false,"merged":[]}